{"text_format":"1","workbook":"xlsx","n_sheets":7,"sheets":["Ａシート　アルミ樹脂複合 記入例","Ａシート　アルミPG 記入例","Ａシート　樹脂 記入例","プルダウン項目 (2)","マスターシート","DATA BASE","建具仕様番号"],"not_rendered":{"charts":0,"images":0,"macros":1,"external_links":1,"defined_names":17,"comments":0,"pivot_tables":0},"unopened":[],"bounds":{"document_bytes":16777216,"sheet_cells":100000,"rows_first":2000,"rows_last":500,"rows_between":2000,"halvings":0,"cell_chars":16384,"cell_head_chars":4096},"cells_cut":0,"cells_raw":0,"read":"whole","date_system":"1900"}

{"sheet":"Ａシート　アルミ樹脂複合 記入例","index":0,"n_rows":50,"n_cols":32,"rows_kept":50,"cut":false,"hidden":false,"merged":[[0,28,0,31],[1,29,1,31],[2,17,2,18],[2,19,2,24],[2,26,2,31],[3,23,4,27],[3,28,4,29],[3,30,4,31],[4,1,5,7],[5,8,8,9],[5,10,5,12],[5,13,6,18],[5,19,8,22],[5,23,8,27],[5,28,8,29],[3,1,3,5],[3,8,4,9],[3,10,3,12],[3,13,4,18],[3,19,4,22],[5,30,8,31],[6,1,6,5],[7,1,8,7],[7,10,7,12],[7,13,7,18],[8,10,8,12],[8,13,8,18],[9,8,9,9],[10,11,12,11],[10,12,11,12],[10,13,15,13],[10,14,11,17],[14,8,15,8],[14,9,15,9],[14,10,15,10],[10,30,15,30],[10,31,15,31],[11,1,15,1],[11,2,15,2],[11,3,15,3],[11,4,15,4],[11,5,15,5],[11,6,15,6],[10,18,15,18],[12,20,12,23],[12,24,13,25],[12,26,13,29],[13,11,15,11],[13,20,15,20],[13,21,15,21],[13,22,15,22],[14,26,15,26],[12,12,15,12],[12,14,15,14],[12,15,15,15],[12,16,15,16],[12,17,15,17],[12,19,15,19],[14,27,15,27],[14,28,15,28],[14,29,15,29],[16,1,16,2],[16,7,16,9],[16,14,16,17],[16,19,16,23],[16,26,16,28],[11,7,15,7],[11,8,11,10],[11,24,11,29],[12,8,13,10],[10,19,11,23],[10,24,10,29],[13,23,15,23],[14,25,15,25],[45,7,45,9],[45,26,45,31],[48,1,49,4],[38,1,38,31],[39,1,39,2],[39,7,39,9],[39,12,39,13],[39,14,39,18],[39,19,39,23],[39,26,39,28]]}
[]
[null,"外部開口部リスト２０２１年版 （兼 製品保証及び納入明細書）",null,null,null,null,null,null,null,null,null,null,null,null,null,null,null,null,"記入例【アルミ樹脂複合】",null,null,null,null,null,null,null,null,null,null,"〔NO．　／　〕"]
[null,null,null,null,null,null,null,null,null,null,null,null,null,null,null,null,null,"現場納入日",null,"〇〇〇〇年〇〇月〇〇日",null,null,null,null,null,"取付確認日","〇〇〇〇年〇〇月〇〇日"]
[null,"物件の名称",null,null,null,null,null,null,"地域区分",null,"販売店名(代表者名）",null,null,"株式会社 〇〇サッシ販売",null,null,null,null,null,"取扱い事業所",null,null,null,"組立事業所登録NO.",null,null,null,null,"施工（管理）者　　　　　　　　　　　　　　　　　　　　　　",null,"納入確認者　　　　　　　　　　　　　　　　"]
[null,"〇△様邸 新築工事"]
[null,null,null,null,null,null,null,null,6,null,"取扱い事業所名",null,null,"株式会社 〇〇サッシ販売　△△営業所",null,null,null,null,null,"印",null,null,null,"１３－〇〇〇〇",null,null,null,null,"印",null,"印"]
[null,"物件の所在地 （又は地番）"]
[null,"〇〇県××市△△　〇丁目△番地×号",null,null,null,null,null,null,null,null,"事業所住所",null,null,"〇〇県△△市××　１２３－４"]
[null,null,null,null,null,null,null,null,null,null,"TEL",null,null,"０１２３-４５-６７８９"]
[]
[null,null,null,null,null,null,null,null,null,null,null,"記入区分","建具　　　　　　　　　　　　　　仕様","　※１参照（サッシ協ＨＰ）","ガラス仕様 　厚さ・種類　　　　　　　　　　　　　　　　　〔①～④各項目を全て記入〕",null,null,null,"　※2参照（サッシ協ＨＰ）","付属部材",null,null,null,null,"住宅性能表示制度の必須項目",null,null,null,null,null,"　　サッシメーカー","　　シリーズ名又は記号"]
[null,"設置階","部位（部屋）","建具番号（窓番）","方位","窓・ドア区分","開閉形式","サイズ呼称","開口面積",null,null,null,null,null,null,null,null,null,null,null,null,null,null,null,"温熱環境・エネルギー消費量"]
[null,null,null,null,null,null,null,null,"※外法寸法　　　　　　　　　　　　　　　　　　　　　（小数点第2位まで）",null,null,null,"種類",null,"①ガラス種類","②Ｌｏｗ－Ｅの有無","③中空層種類","④中空層厚み",null,"なし","あり",null,null,null,"熱貫流率\n　U値\n［W/㎡K］",null,"日射熱取得率  \nη値"]
[null,null,null,null,null,null,null,null,null,null,null,"仕様　　　　　　　　　　　　　　　　　　　　　　又は　　　　　　　計算　　　　　　　　　　（試験）",null,null,null,null,null,null,null,null,"シャッター・雨戸","和障子","風除室","外付ブラインド"]
[null,null,null,null,null,null,null,null,"外法　　 W　　　　（㎜）","外法　　　　　H　　　　　  （㎜）","W×H　　　（㎡）",null,null,null,null,null,null,null,null,null,null,null,null,null,null,"性能根拠","付属\n部材\nなし","和障子","外付　　　　　　　　　　　　ブラインド","性能根拠"]
[]
[null,"選  択",null,"直接記入","選  択","選  択","選     択","直接記入",null,null,"自動表記","選  択","選     択","自動表記","選     択",null,null,null,"自動表記","選     択",null,null,null,null,"自動表記/直接入力","自動表記","自動表記/直接入力",null,null,"自動表記","選   択","直接記入"]
[1,"１階","リビング","ＡＷ-1","南","一重窓","引違い","16520",1690,2030,{"$f":"I18*J18/1000000","v":3.4306999999999999},"仕様","アルミ樹脂複合",{"$f":"VLOOKUP(M18,'プルダウン項目 (2)'!M27:N42,2,0)","v":2},"複層","LowE（日射取得型）","A",16,{"$f":"GLASS_SPEC5(N18,O18,P18,Q18,R18,\"マスターシート!A3:F433\")","v":78},"○","　","　","　","　",{"$f":"VALUE_U_ETA_P(N18,S18,\"DATA BASE\",\"A\",\"F\",\"G3:G433\")","v":2.91},{"$f":"VLOOKUP(L18,'プルダウン項目 (2)'!N6:O8,2,0)","v":"ｻｯｼ協ＨＰ"},{"$f":"VALUE_U_ETA(T18,N18,S18,\"DATA BASE\",\"A\",\"F\",\"H3:H433\")","v":0.51},{"$f":"VALUE_U_ETA_2(V18,X18,N18,S18,\"DATA BASE\",\"A\",\"F\",\"I3:I433\")","v":""},{"$f":"VALUE_U_ETA(X18,N18,S18,\"DATA BASE\",\"A\",\"F\",\"J3:J433\")","v":""},{"$f":"VLOOKUP(L18,'プルダウン項目 (2)'!N6:O8,2,0)","v":"ｻｯｼ協ＨＰ"},"日本サッシ","ＡＪサッシ"]
[2,"１階","リビング","ＡＷ-2","南","一重窓","引違い","16520",1690,2030,{"$f":"I19*J19/1000000","v":3.4306999999999999},"仕様","アルミ樹脂複合",{"$f":"VLOOKUP(M19,'プルダウン項目 (2)'!M27:N42,2,0)","v":2},"複層","LowE（日射取得型）","A",16,{"$f":"GLASS_SPEC5(N19,O19,P19,Q19,R19,\"マスターシート!A3:F433\")","v":78},"○","　",null,null,null,{"$f":"VALUE_U_ETA_P(N19,S19,\"DATA BASE\",\"A\",\"F\",\"G3:G433\")","v":2.91},{"$f":"VLOOKUP(L19,'プルダウン項目 (2)'!N6:O8,2,0)","v":"ｻｯｼ協ＨＰ"},{"$f":"VALUE_U_ETA(T19,N19,S19,\"DATA BASE\",\"A\",\"F\",\"H3:H433\")","v":0.51},{"$f":"VALUE_U_ETA_2(V19,X19,N19,S19,\"DATA BASE\",\"A\",\"F\",\"I3:I433\")","v":""},"",{"$f":"VLOOKUP(L19,'プルダウン項目 (2)'!N6:O8,2,0)","v":"ｻｯｼ協ＨＰ"},"日本サッシ","ＡＪサッシ"]
[3,"１階","和室","ＡＷ-3","南","一重窓","引違い","25620",2600,2030,5.2779999999999996,"仕様","アルミ樹脂複合",{"$f":"VLOOKUP(M20,'プルダウン項目 (2)'!M27:N42,2,0)","v":2},"複層","LowE（日射取得型）","A",16,78,"○","　",null,null,null,{"$f":"VALUE_U_ETA_P(N20,S20,\"DATA BASE\",\"A\",\"F\",\"G3:G433\")","v":2.91},{"$f":"VLOOKUP(L20,'プルダウン項目 (2)'!N6:O8,2,0)","v":"ｻｯｼ協ＨＰ"},{"$f":"VALUE_U_ETA(T20,N20,S20,\"DATA BASE\",\"A\",\"F\",\"H3:H433\")","v":0.51},{"$f":"VALUE_U_ETA_2(V20,X20,N20,S20,\"DATA BASE\",\"A\",\"F\",\"I3:I433\")","v":""},"",{"$f":"VLOOKUP(L20,'プルダウン項目 (2)'!N6:O8,2,0)","v":"ｻｯｼ協ＨＰ"},"日本サッシ","ＡＪサッシ"]
{"$rows_left_out":31}
{"sheet":"Ａシート　アルミPG 記入例","index":1,"n_rows":50,"n_cols":32,"rows_kept":50,"cut":false,"hidden":false,"merged":[[0,28,0,31],[1,29,1,31],[2,17,2,18],[2,19,2,24],[2,26,2,31],[3,23,4,27],[3,28,4,29],[3,30,4,31],[4,1,5,7],[5,8,8,9],[5,10,5,12],[5,13,6,18],[5,19,8,22],[5,23,8,27],[5,28,8,29],[3,1,3,5],[3,8,4,9],[3,10,3,12],[3,13,4,18],[3,19,4,22],[5,30,8,31],[6,1,6,5],[7,1,8,7],[7,10,7,12],[7,13,7,18],[8,10,8,12],[8,13,8,18],[9,8,9,9],[10,11,12,11],[10,12,11,12],[10,13,15,13],[10,14,11,17],[14,8,15,8],[14,9,15,9],[14,10,15,10],[10,30,15,30],[10,31,15,31],[11,1,15,1],[11,2,15,2],[11,3,15,3],[11,4,15,4],[11,5,15,5],[11,6,15,6],[10,18,15,18],[12,20,12,23],[12,24,13,25],[12,26,13,29],[13,11,15,11],[13,20,15,20],[13,21,15,21],[13,22,15,22],[14,26,15,26],[12,12,15,12],[12,14,15,14],[12,15,15,15],[12,16,15,16],[12,17,15,17],[12,19,15,19],[14,27,15,27],[14,28,15,28],[14,29,15,29],[16,1,16,2],[16,7,16,9],[16,14,16,17],[16,19,16,23],[16,26,16,28],[11,7,15,7],[11,8,11,10],[11,24,11,29],[12,8,13,10],[10,19,11,23],[10,24,10,29],[13,23,15,23],[14,25,15,25],[45,7,45,9],[45,26,45,31],[48,1,49,4],[38,1,38,31],[39,1,39,2],[39,7,39,9],[39,12,39,13],[39,14,39,18],[39,19,39,23],[39,26,39,28]]}
[]
[null,"外部開口部リスト２０２１年版 （兼 製品保証及び納入明細書）",null,null,null,null,null,null,null,null,null,null,null,null,null,null,null,"記入例【アルミＰＧ】",null,null,null,null,null,null,null,null,null,null,null,"〔NO．　／　〕"]
[null,null,null,null,null,null,null,null,null,null,null,null,null,null,null,null,null,"現場納入日",null,"　　　　年　　月　　日",null,null,null,null,null,"取付確認日","　　　　年　　月　　日"]
[null,"物件の名称",null,null,null,null,null,null,"地域区分",null,"販売店名(代表者名）",null,null,"株式会社 〇〇サッシ販売",null,null,null,null,null,"取扱い事業所",null,null,null,"組立事業所登録NO.",null,null,null,null,"施工（管理）者　　　　　　　　　　　　　　　　　　　　　　",null,"納入確認者　　　　　　　　　　　　　　　　"]
[null,"〇△様邸 新築工事"]
[null,null,null,null,null,null,null,null,6,null,"取扱い事業所名",null,null,"株式会社 〇〇サッシ販売　△△営業所",null,null,null,null,null,"印",null,null,null,"１３－〇〇〇〇",null,null,null,null,"印",null,"印"]
[null,"物件の所在地 （又は地番）"]
[null,"〇〇県××市△△　〇丁目△番地×号",null,null,null,null,null,null,null,null,"事業所住所",null,null,"〇〇県△△市××　１２３－４"]
[null,null,null,null,null,null,null,null,null,null,"TEL",null,null,"０１２３-４５-６７８９"]
[]
[null,null,null,null,null,null,null,null,null,null,null,"記入区分","建具　　　　　　　　　　　　　　仕様","　※１参照（サッシ協ＨＰ）","ガラス仕様 　厚さ・種類　　　　　　　　　　　　　　　　　〔①～④各項目を全て記入〕",null,null,null,"　※2参照（サッシ協ＨＰ）","付属部材",null,null,null,null,"住宅性能表示制度の必須項目",null,null,null,null,null,"　　サッシメーカー","　　シリーズ名又は記号"]
[null,"設置階","部位（部屋）","建具番号（窓番）","方位","窓・ドア区分","開閉形式","サイズ呼称","開口面積",null,null,null,null,null,null,null,null,null,null,null,null,null,null,null,"温熱環境・エネルギー消費量"]
[null,null,null,null,null,null,null,null,"※外法寸法　　　　　　　　　　　　　　　　　　　　　（小数点第2位まで）",null,null,null,"種類",null,"①ガラス種類","②Ｌｏｗ－Ｅの有無","③中空層種類","④中空層厚み",null,"なし","あり",null,null,null,"熱貫流率\n　U値\n［W/㎡K］",null,"日射熱取得率  \nη値"]
[null,null,null,null,null,null,null,null,null,null,null,"仕様　　　　　　　　　　　　　　　　　　　　　　又は　　　　　　　計算　　　　　　　　　　（試験）",null,null,null,null,null,null,null,null,"シャッター・雨戸","和障子","風除室","外付ブラインド"]
[null,null,null,null,null,null,null,null,"外法　　 W　　　　（㎜）","外法　　　　　H　　　　　  （㎜）","W×H　　　（㎡）",null,null,null,null,null,null,null,null,null,null,null,null,null,null,"性能根拠","付属\n部材\nなし","和障子","外付　　　　　　　　　　　　ブラインド","性能根拠"]
[]
[null,"選  択",null,"直接記入","選  択","選  択","選     択","直接記入",null,null,"自動表記","選  択","選     択","自動表記","選     択",null,null,null,"自動表記","選     択",null,null,null,null,"自動表記/直接入力","自動表記","自動表記/直接入力",null,null,"自動表記","選   択","直接記入"]
[1,"１階","リビング","ＡＷ-1","南","一重窓","引違い","16520",1690,2030,{"$f":"I18*J18/1000000","v":3.4306999999999999},"仕様","アルミＰＧ",{"$f":"VLOOKUP(M18,'プルダウン項目 (2)'!M27:N42,2,0)","v":3},"複層","無し","A",16,{"$f":"GLASS_SPEC5(N18,O18,P18,Q18,R18,\"マスターシート!A3:F433\")","v":95},"○","　","　","　","　",{"$f":"VALUE_U_ETA_P(N18,S18,\"DATA BASE\",\"A\",\"F\",\"G3:G433\")","v":4.07},{"$f":"VLOOKUP(L18,'プルダウン項目 (2)'!N6:O8,2,0)","v":"ｻｯｼ協ＨＰ"},{"$f":"VALUE_U_ETA(T18,N18,S18,\"DATA BASE\",\"A\",\"F\",\"H3:H433\")","v":0.63},{"$f":"VALUE_U_ETA_2(V18,X18,N18,S18,\"DATA BASE\",\"A\",\"F\",\"I3:I433\")","v":""},{"$f":"VALUE_U_ETA(X18,N18,S18,\"DATA BASE\",\"A\",\"F\",\"J3:J433\")","v":""},{"$f":"VLOOKUP(L18,'プルダウン項目 (2)'!N6:O8,2,0)","v":"ｻｯｼ協ＨＰ"},"日本サッシ","ＰＧサッシ"]
[2,"１階","リビング","ＡＷ-2","南","一重窓","引違い","16520",1690,2030,{"$f":"I19*J19/1000000","v":3.4306999999999999},"仕様","アルミＰＧ",{"$f":"VLOOKUP(M19,'プルダウン項目 (2)'!M27:N42,2,0)","v":3},"複層","無し","A",16,{"$f":"GLASS_SPEC5(N19,O19,P19,Q19,R19,\"マスターシート!A3:F433\")","v":95},"○","　",null,null,null,{"$f":"VALUE_U_ETA_P(N19,S19,\"DATA BASE\",\"A\",\"F\",\"G3:G433\")","v":4.07},{"$f":"VLOOKUP(L19,'プルダウン項目 (2)'!N6:O8,2,0)","v":"ｻｯｼ協ＨＰ"},{"$f":"VALUE_U_ETA(T19,N19,S19,\"DATA BASE\",\"A\",\"F\",\"H3:H433\")","v":0.63},{"$f":"VALUE_U_ETA_2(V19,X19,N19,S19,\"DATA BASE\",\"A\",\"F\",\"I3:I433\")","v":""},"",{"$f":"VLOOKUP(L19,'プルダウン項目 (2)'!N6:O8,2,0)","v":"ｻｯｼ協ＨＰ"},"日本サッシ","ＰＧサッシ"]
[3,"１階","和室","ＡＷ-3","南","一重窓","引違い","25620",2600,2030,5.2779999999999996,"仕様","アルミＰＧ",{"$f":"VLOOKUP(M20,'プルダウン項目 (2)'!M27:N42,2,0)","v":3},"複層","無し","A",16,95,"○","　",null,null,null,{"$f":"VALUE_U_ETA_P(N20,S20,\"DATA BASE\",\"A\",\"F\",\"G3:G433\")","v":4.07},{"$f":"VLOOKUP(L20,'プルダウン項目 (2)'!N6:O8,2,0)","v":"ｻｯｼ協ＨＰ"},{"$f":"VALUE_U_ETA(T20,N20,S20,\"DATA BASE\",\"A\",\"F\",\"H3:H433\")","v":0.63},{"$f":"VALUE_U_ETA_2(V20,X20,N20,S20,\"DATA BASE\",\"A\",\"F\",\"I3:I433\")","v":""},"",{"$f":"VLOOKUP(L20,'プルダウン項目 (2)'!N6:O8,2,0)","v":"ｻｯｼ協ＨＰ"},"日本サッシ","ＰＧサッシ"]
{"$rows_left_out":31}
{"sheet":"Ａシート　樹脂 記入例","index":2,"n_rows":50,"n_cols":32,"rows_kept":50,"cut":false,"hidden":false,"merged":[[48,1,49,4],[45,26,45,31],[3,28,4,29],[3,30,4,31],[5,28,8,29],[5,30,8,31],[10,19,11,23],[10,30,15,30],[12,19,15,19],[10,31,15,31],[3,1,3,5],[3,8,4,9],[3,10,3,12],[3,13,4,18],[3,19,4,22],[4,1,5,7],[0,28,0,31],[1,29,1,31],[2,17,2,18],[2,19,2,24],[2,26,2,31],[5,8,8,9],[5,10,5,12],[5,13,6,18],[5,19,8,22],[6,1,6,5],[7,1,8,7],[7,10,7,12],[7,13,7,18],[8,10,8,12],[8,13,8,18],[9,8,9,9],[10,11,12,11],[10,12,11,12],[10,13,15,13],[11,8,11,10],[14,8,15,8],[14,9,15,9],[14,10,15,10],[12,8,13,10],[12,12,15,12],[45,7,45,9],[10,14,11,17],[10,18,15,18],[12,14,15,14],[12,15,15,15],[12,16,15,16],[12,17,15,17],[11,7,15,7],[39,14,39,18],[39,12,39,13],[13,11,15,11],[5,23,8,27],[3,23,4,27],[10,24,10,29],[11,24,11,29],[12,24,13,25],[12,26,13,29],[12,20,12,23],[13,20,15,20],[13,21,15,21],[13,22,15,22],[13,23,15,23],[14,26,15,26],[14,27,15,27],[14,28,15,28],[14,25,15,25],[14,29,15,29],[16,19,16,23],[39,7,39,9],[39,19,39,23],[38,1,38,31],[39,26,39,28],[16,26,16,28],[16,1,16,2],[11,1,15,1],[11,2,15,2],[39,1,39,2],[16,7,16,9],[16,14,16,17],[11,3,15,3],[11,4,15,4],[11,5,15,5],[11,6,15,6]]}
[]
[null,"外部開口部リスト２０２１年版 （兼 製品保証及び納入明細書）",null,null,null,null,null,null,null,null,null,null,null,null,null,null,null,"記入例【樹脂】",null,null,null,null,null,null,null,null,null,null,null,"〔NO．　／　〕"]
[null,null,null,null,null,null,null,null,null,null,null,null,null,null,null,null,null,"現場納入日",null,"　　　　年　　月　　日",null,null,null,null,null,"取付確認日","　　　　年　　月　　日"]
[null,"物件の名称",null,null,null,null,null,null,"地域区分",null,"販売店名(代表者名）",null,null,"株式会社 〇〇サッシ販売",null,null,null,null,null,"取扱い事業所",null,null,null,"組立事業所登録NO.",null,null,null,null,"施工（管理）者　　　　　　　　　　　　　　　　　　　　　　",null,"納入確認者　　　　　　　　　　　　　　　　"]
[null,"〇△様邸 新築工事"]
[null,null,null,null,null,null,null,null,6,null,"取扱い事業所名",null,null,"株式会社 〇〇サッシ販売　△△営業所",null,null,null,null,null,"印",null,null,null,"１３－〇〇〇〇",null,null,null,null,"印",null,"印"]
[null,"物件の所在地 （又は地番）"]
[null,"〇〇県××市△△　〇丁目△番地×号",null,null,null,null,null,null,null,null,"事業所住所",null,null,"〇〇県△△市××　１２３－４"]
[null,null,null,null,null,null,null,null,null,null,"TEL",null,null,"０１２３-４５-６７８９"]
[]
[null,null,null,null,null,null,null,null,null,null,null,"記入区分","建具　　　　　　　　　　　　　　仕様","　※１参照（サッシ協ＨＰ）","ガラス仕様 　厚さ・種類　　　　　　　　　　　　　　　　　〔①～④各項目を全て記入〕",null,null,null,"　※2参照（サッシ協ＨＰ）","付属部材",null,null,null,null,"住宅性能表示制度の必須項目",null,null,null,null,null,"　　サッシメーカー","　　シリーズ名又は記号"]
[null,"設置階","部位（部屋）","建具番号（窓番）","方位","窓・ドア区分","開閉形式","サイズ呼称","開口面積",null,null,null,null,null,null,null,null,null,null,null,null,null,null,null,"温熱環境・エネルギー消費量"]
[null,null,null,null,null,null,null,null,"※外法寸法　　　　　　　　　　　　　　　　　　　　　（小数点第2位まで）",null,null,null,"種類",null,"①ガラス種類","②Ｌｏｗ－Ｅの有無","③中空層種類","④中空層厚み",null,"なし","あり",null,null,null,"熱貫流率\n　U値\n［W/㎡K］",null,"日射熱取得率  \nη値"]
[null,null,null,null,null,null,null,null,null,null,null,"仕様　　　　　　　　　　　　　　　　　　　　　　又は　　　　　　　計算　　　　　　　　　　（試験）",null,null,null,null,null,null,null,null,"シャッター・雨戸","和障子","風除室","外付ブラインド"]
[null,null,null,null,null,null,null,null,"外法　　 W　　　　（㎜）","外法　　　　　H　　　　　  （㎜）","W×H　　　（㎡）",null,null,null,null,null,null,null,null,null,null,null,null,null,null,"性能根拠","付属\n部材\nなし","和障子","外付　　　　　　　　　　　　ブラインド","性能根拠"]
[]
[null,"選  択",null,"直接記入","選  択","選  択","選     択","直接記入",null,null,"自動表記","選  択","選     択","自動表記","選     択",null,null,null,"自動表記","選     択",null,null,null,null,"自動表記/直接入力","自動表記","自動表記/直接入力",null,null,"自動表記","選   択","直接記入"]
[1,"１階","リビング","ＡＷ-1","南","一重窓","引違い","16520",1690,2030,{"$f":"I18*J18/1000000","v":3.4306999999999999},"仕様","樹脂",{"$f":"VLOOKUP(M18,'プルダウン項目 (2)'!M27:N42,2,0)","v":1},"複層","LowE（日射取得型）","G",16,{"$f":"GLASS_SPEC5(N18,O18,P18,Q18,R18,\"マスターシート!A3:F433\")","v":31},"○","　","　","　","　",{"$f":"VALUE_U_ETA_P(N18,S18,\"DATA BASE\",\"A\",\"F\",\"G3:G433\")","v":2.15},{"$f":"VLOOKUP(L18,'プルダウン項目 (2)'!N6:O8,2,0)","v":"ｻｯｼ協ＨＰ"},{"$f":"VALUE_U_ETA(T18,N18,S18,\"DATA BASE\",\"A\",\"F\",\"H3:H433\")","v":0.46},{"$f":"VALUE_U_ETA_2(V18,X18,N18,S18,\"DATA BASE\",\"A\",\"F\",\"I3:I433\")","v":""},{"$f":"VALUE_U_ETA(X18,N18,S18,\"DATA BASE\",\"A\",\"F\",\"J3:J433\")","v":""},{"$f":"VLOOKUP(L18,'プルダウン項目 (2)'!N6:O8,2,0)","v":"ｻｯｼ協ＨＰ"},"日本サッシ","Ｊサッシ"]
[2,"１階","リビング","ＡＷ-2","南","一重窓","引違い","16520",1690,2030,{"$f":"I19*J19/1000000","v":3.4306999999999999},"仕様","樹脂",{"$f":"VLOOKUP(M19,'プルダウン項目 (2)'!M27:N42,2,0)","v":1},"複層","LowE（日射取得型）","G",16,{"$f":"GLASS_SPEC5(N19,O19,P19,Q19,R19,\"マスターシート!A3:F433\")","v":31},"○","　",null,null,null,{"$f":"VALUE_U_ETA_P(N19,S19,\"DATA BASE\",\"A\",\"F\",\"G3:G433\")","v":2.15},{"$f":"VLOOKUP(L19,'プルダウン項目 (2)'!N6:O8,2,0)","v":"ｻｯｼ協ＨＰ"},{"$f":"VALUE_U_ETA(T19,N19,S19,\"DATA BASE\",\"A\",\"F\",\"H3:H433\")","v":0.46},{"$f":"VALUE_U_ETA_2(V19,X19,N19,S19,\"DATA BASE\",\"A\",\"F\",\"I3:I433\")","v":""},"",{"$f":"VLOOKUP(L19,'プルダウン項目 (2)'!N6:O8,2,0)","v":"ｻｯｼ協ＨＰ"},"日本サッシ","Ｊサッシ"]
[3,"１階","和室","ＡＷ-3","南","一重窓","引違い","25620",2600,2030,5.2779999999999996,"仕様","樹脂",{"$f":"VLOOKUP(M20,'プルダウン項目 (2)'!M27:N42,2,0)","v":1},"複層","LowE（日射取得型）","G",16,31,"○","　",null,null,null,{"$f":"VALUE_U_ETA_P(N20,S20,\"DATA BASE\",\"A\",\"F\",\"G3:G433\")","v":2.15},{"$f":"VLOOKUP(L20,'プルダウン項目 (2)'!N6:O8,2,0)","v":"ｻｯｼ協ＨＰ"},{"$f":"VALUE_U_ETA(T20,N20,S20,\"DATA BASE\",\"A\",\"F\",\"H3:H433\")","v":0.46},{"$f":"VALUE_U_ETA_2(V20,X20,N20,S20,\"DATA BASE\",\"A\",\"F\",\"I3:I433\")","v":""},"",{"$f":"VLOOKUP(L20,'プルダウン項目 (2)'!N6:O8,2,0)","v":"ｻｯｼ協ＨＰ"},"日本サッシ","Ｊサッシ"]
{"$rows_left_out":31}
{"sheet":"プルダウン項目 (2)","index":3,"n_rows":243,"n_cols":15,"rows_kept":243,"cut":false,"hidden":true,"merged":[[3,2,3,3],[3,10,3,11],[65,1,65,2],[83,7,83,8],[0,10,0,11]]}
[null,"７）書式のプルダウン項目",null,null,null,null,null,null,null,null,"2021.04.1"]
[null,"　　下記項目は、プルダウンにより選択することができます。"]
[]
[null,"９．設置階","１０．部位（部屋）",null,"１２．方位","１３．窓・ドア区分","１４．開閉形式",null,null,null,"１７．仕様又は計算、試験"]
[null,"１階","玄関",null,"南","一重窓","引違い",null,null,null,"仕様",null,null,"28　30"]
[null,"２階","和室",null,"南西","二重窓","ＦＩＸ",null,null,null,"計算/試験",null,null,"仕様","ｻｯｼ協ＨＰ"]
[null,"３階","寝室",null,"南東","ドア","上げ下げ",null,null,null,null,null,null,"計算/試験","計算/試験"]
[null,"地下","子供室",null,"西","引戸","たてすべり出し",null,null,null,null,null,null,"-","-"]
[null,null,"洋間",null,"東",null,"すべり出し"]
[null,null,"トイレ",null,"北西",null,"外倒し"]
[null,null,"洗面所",null,"北東",null,"内倒し"]
[null,null,"浴室",null,"北",null,"ルーバー"]
[null,null,"キッチン",null,"屋根上面",null,"オーニング"]
[null,null,"リビング",null,"下面",null,"突き出し"]
[null,null,"ダイニング",null,null,null,"出窓"]
[null,null,"ＬＤK",null,null,null,"天窓"]
[null,null,"ホール",null,null,null,"折りたたみ",null,null,"１１．建具番号は事業所が入力"]
[null,null,"クローゼット",null,null,null,"ガラスブロック"]
[null,null,"廊下",null,null,null,"その他窓",null,null,"１５．サイズ呼称は事業所が入力"]
[null,null,"階段",null,null,null,"玄関ドア",null,null,"１６．外法寸法（ｍｍ）は事業所が入力"]
{"$rows_left_out":224}
{"sheet":"マスターシート","index":4,"n_rows":394,"n_cols":6,"rows_kept":394,"cut":false,"hidden":true,"merged":[]}
["No20","No21","No22","No23","No24","No25"]
["建具仕様","ガラス種類","Ｌｏｗ－Ｅの有無","中空層種類","中空層厚み","建研ＨＰ"]
[1,"三層","ダブルLowE（日射取得型）","G","6×2",7]
[1,"三層","ダブルLowE（日射遮蔽型）","G","6×2",8]
[1,"三層","ダブルLowE（日射取得型）","G","7×2",5]
[1,"三層","ダブルLowE（日射遮蔽型）","G","7×2",6]
[1,"三層","ダブルLowE（日射取得型）","G","8×2",5]
[1,"三層","ダブルLowE（日射遮蔽型）","G","8×2",6]
[1,"三層","ダブルLowE（日射取得型）","G","9×2",5]
[1,"三層","ダブルLowE（日射遮蔽型）","G","9×2",6]
[1,"三層","ダブルLowE（日射取得型）","G","10×2",3]
[1,"三層","ダブルLowE（日射遮蔽型）","G","10×2",4]
[1,"三層","ダブルLowE（日射取得型）","G","11×2",3]
[1,"三層","ダブルLowE（日射遮蔽型）","G","11×2",4]
[1,"三層","ダブルLowE（日射取得型）","G","12×2",3]
[1,"三層","ダブルLowE（日射遮蔽型）","G","12×2",4]
[1,"三層","ダブルLowE（日射取得型）","G","13×2",1]
[1,"三層","ダブルLowE（日射遮蔽型）","G","13×2",2]
[1,"三層","ダブルLowE（日射取得型）","G","14×2",1]
[1,"三層","ダブルLowE（日射遮蔽型）","G","14×2",2]
{"$rows_left_out":375}
{"sheet":"DATA BASE","index":5,"n_rows":394,"n_cols":10,"rows_kept":394,"cut":false,"hidden":true,"merged":[[0,7,0,9]]}
["No20","No21","No22","No23","No24","No25","No27","No29"]
["建具仕様","ガラス種類","Ｌｏｗ－Ｅの有無","中空層種類","中空層厚み","建建ＨＰ","Ｕ値","η値","和障子","外付け\nブラインド"]
[1,"三層","ダブルLowE（日射取得型）","G","6×2",7,2.15,0.39,0.24,0.09]
[1,"三層","ダブルLowE（日射遮蔽型）","G","6×2",8,2.15,0.24,0.16,0.06]
[1,"三層","ダブルLowE（日射取得型）","G","7×2",5,1.9,0.39,0.24,0.09]
[1,"三層","ダブルLowE（日射遮蔽型）","G","7×2",6,1.9,0.24,0.16,0.06]
[1,"三層","ダブルLowE（日射取得型）","G","8×2",5,1.9,0.39,0.24,0.09]
[1,"三層","ダブルLowE（日射遮蔽型）","G","8×2",6,1.9,0.24,0.16,0.06]
[1,"三層","ダブルLowE（日射取得型）","G","9×2",5,1.9,0.39,0.24,0.09]
[1,"三層","ダブルLowE（日射遮蔽型）","G","9×2",6,1.9,0.24,0.16,0.06]
[1,"三層","ダブルLowE（日射取得型）","G","10×2",3,1.7,0.39,0.24,0.09]
[1,"三層","ダブルLowE（日射遮蔽型）","G","10×2",4,1.7,0.24,0.16,0.06]
[1,"三層","ダブルLowE（日射取得型）","G","11×2",3,1.7,0.39,0.24,0.09]
[1,"三層","ダブルLowE（日射遮蔽型）","G","11×2",4,1.7,0.24,0.16,0.06]
[1,"三層","ダブルLowE（日射取得型）","G","12×2",3,1.7,0.39,0.24,0.09]
[1,"三層","ダブルLowE（日射遮蔽型）","G","12×2",4,1.7,0.24,0.16,0.06]
[1,"三層","ダブルLowE（日射取得型）","G","13×2",1,1.6,0.39,0.24,0.09]
[1,"三層","ダブルLowE（日射遮蔽型）","G","13×2",2,1.6,0.24,0.16,0.06]
[1,"三層","ダブルLowE（日射取得型）","G","14×2",1,1.6,0.39,0.24,0.09]
[1,"三層","ダブルLowE（日射遮蔽型）","G","14×2",2,1.6,0.24,0.16,0.06]
{"$rows_left_out":375}
{"sheet":"建具仕様番号","index":6,"n_rows":12,"n_cols":2,"rows_kept":12,"cut":false,"hidden":true,"merged":[]}
["樹脂",1]
["アルミ樹脂複合",2]
["アルミ熱遮断構造",3]
["アルミＰＧ",3]
["アルミＳＧ",3]
["アルミＳＧ＋樹脂内窓",4]
["木製",1]
["アルミ木複合",2]
["ドア１",7]
["ドア２",7]
["ドア３",7]
["ドア４",7]